Target
D(3) dopamine receptor
Ligand
BDBM50154896
Substrate
Meas. Tech.
[3H]-Spiperone Binding Assay
Ki
1.48±n/a nM
Citation
 Cremonesi, SMicheli, FSemeraro, TTarsi, L Substituted 3,6-diazabicyclo[3.2.0]heptanes US Patent  US10584135 Publication Date 3/10/2020 
Target
Name:
D(3) dopamine receptor
Synonyms:
DOPAMINE D3 DRD3_HUMAN Dopamine D3 receptor (D3) Dopamine receptor Dopamine receptor D3
Type:
Mol. Mass.:
44243.43
Organism:
Homo sapiens (Human)
Description:
Residue:
400
  
Inhibitor
Name:
BDBM50154896
Synonyms:
CHEMBL3774462 US10584135, Example 51
Type:
Small organic molecule
Emp. Form.:
C24H32F3N5S
Mol. Mass.:
479.605
SMILES:
Cn1c(SCCCN2CC3CCN(C3C2)c2ccc(cc2)C(F)(F)F)nnc1C1CCCC1
: