Target
D(3) dopamine receptor
Ligand
BDBM382274
Substrate
Meas. Tech.
[3H]-Spiperone Binding Assay
Ki
2.14±n/a nM
Citation
 Cremonesi, SMicheli, FSemeraro, TTarsi, L Substituted 3,6-diazabicyclo[3.2.0]heptanes US Patent  US10584135 Publication Date 3/10/2020 
Target
Name:
D(3) dopamine receptor
Synonyms:
DOPAMINE D3 DRD3_HUMAN Dopamine D3 receptor (D3) Dopamine receptor Dopamine receptor D3
Type:
Mol. Mass.:
44243.43
Organism:
Homo sapiens (Human)
Description:
Residue:
400
  
Inhibitor
Name:
BDBM382274
Synonyms:
US10273244, Example 145 | US10584135, Example 145
Type:
Small organic molecule
Emp. Form.:
C24H27F3N6S
Mol. Mass.:
488.572
SMILES:
Cn1c(SCCCN2C[C@H]3CCN([C@H]3C2)c2ccc(cc2)C(F)(F)F)nnc1-c1cccnc1
: