Target
Diacylglycerol O-acyltransferase 2
Ligand
BDBM435242
Substrate
Meas. Tech.
Enzymatic Activity Assay
IC50
15.5±n/a nM
Citation
 Imbriglio, JLiang, RLondon, CMarby, KTata, JYou, MXiong, Y Tetrahydroisoquinoline derivatives useful as inhibitors of diacylglyceride O-acyltransferase 2 US Patent  US10568876 Publication Date 2/25/2020 
Target
Name:
Diacylglycerol O-acyltransferase 2
Synonyms:
ARAT DGAT2 Diacylglycerol O-acyltransferase 2 (DGAT2) Retinol O-fatty-acyltransferase
Type:
Multi-pass membrane protein
Mol. Mass.:
43848.90
Organism:
Homo sapiens (Human)
Description:
Q96PD7
Residue:
388
  
Inhibitor
Name:
BDBM435242
Synonyms:
US10568876, Example 21 methyl 3-(2-(tert-butylcarbamoyl)-8- ((2-(3-methyl-1,2,4-oxadiazol-5- yl)cyclopropanecarboxamido)methyl)- 1,2,3,4-tetrahydroisoquinolin-5- yl)benzoate (mixture of 4 isomers)
Type:
Small organic molecule
Emp. Form.:
C30H35N5O5
Mol. Mass.:
545.6294
SMILES:
COC(=O)c1cccc(c1)-c1ccc(CNC(=O)C2CC2c2nc(C)no2)c2CN(CCc12)C(=O)NC(C)(C)C
: