Target
Diacylglycerol O-acyltransferase 2
Ligand
BDBM435318
Substrate
Meas. Tech.
Enzymatic Activity Assay
IC50
477±n/a nM
Citation
 Imbriglio, JLiang, RLondon, CMarby, KTata, JYou, MXiong, Y Tetrahydroisoquinoline derivatives useful as inhibitors of diacylglyceride O-acyltransferase 2 US Patent  US10568876 Publication Date 2/25/2020 
Target
Name:
Diacylglycerol O-acyltransferase 2
Synonyms:
ARAT DGAT2 Diacylglycerol O-acyltransferase 2 (DGAT2) Retinol O-fatty-acyltransferase
Type:
Multi-pass membrane protein
Mol. Mass.:
43848.90
Organism:
Homo sapiens (Human)
Description:
Q96PD7
Residue:
388
  
Inhibitor
Name:
BDBM435318
Synonyms:
N-((2-(2-(tert-butylamino)-2-oxoethyl)-5- (3-(trifluoromethoxy)phenyl)-1,2,3,4- tetrahydroisoquinolin-8-yl)methyl)-2-(3- methyl-1,2,4-oxadiazol-5- yl)cyclopropanecarboxamide (mixture of 4 isomers) | US10568876, Example 80
Type:
Small organic molecule
Emp. Form.:
C30H34F3N5O4
Mol. Mass.:
585.6173
SMILES:
Cc1noc(n1)C1CC1C(=O)NCc1ccc(-c2cccc(OC(F)(F)F)c2)c2CCN(CC(=O)NC(C)(C)C)Cc12
: