Target
Serine/threonine-protein kinase B-raf [V600E]
Ligand
BDBM221690
Substrate
Meas. Tech.
Amplified Luminescence Proximity Homogeneous Assay
IC50
0.500±n/a nM
Citation
 Huang, SJin, XLiu, ZPoon, DTellew, JWan, YWang, XXie, Y Compounds and compositions as protein kinase inhibitors US Patent  US10568884 Publication Date 2/25/2020 
Target
Name:
Serine/threonine-protein kinase B-raf [V600E]
Synonyms:
B-RAF V600E B-Raf Protein Kinase Mutant (V600E) BRAF BRAF mutant V600E BRAF_HUMAN Protein mono-ADP-ribosyltransferase (PARP3) RAFB1 Serine/threonine-protein kinase B-raf (V600E) V-RAF murine sarcoma viral oncogene homologue B1 mutant (BRAF V600E)
Type:
Mol. Mass.:
84474.98
Organism:
Homo sapiens (Human)
Description:
P15056 V600E
Residue:
766
  
Inhibitor
Name:
BDBM221690
Synonyms:
US10568884, Cpd 11 US9593100, Compound 11 | USRE49556, Compound 11
Type:
Small organic molecule
Emp. Form.:
C21H25ClFN7O4S
Mol. Mass.:
525.984
SMILES:
CCn1cc(c(n1)-c1cc(Cl)cc(NS(C)(=O)=O)c1F)-c1ccnc(NC[C@H](C)NC(=O)OC)n1
: