Target
Estrogen receptor
Ligand
BDBM435385
Substrate
Meas. Tech.
Fluorescence Polarization Displacement
Kd
320±40 nM
Citation
 Donaldson, WASem, DSNeumann, TS Substituted (4'-hydroxyphenyl)cyclohexane compounds and uses thereof as selective agonists of the estrogen receptor beta isoform US Patent  US10570077 Publication Date 2/25/2020 
Target
Name:
Estrogen receptor
Synonyms:
ER ESR ESR1_HUMAN Estrogen receptor Estrogen receptor (ER-alpha) Estrogen receptor alpha (ER) Nuclear receptor subfamily 3 group A member 1
Type:
Protein
Mol. Mass.:
66230.44
Organism:
Homo sapiens (Human)
Description:
P03372
Residue:
595
  
Inhibitor
Name:
BDBM435385
Synonyms:
US10570077, Compound 4
Type:
Small organic molecule
Emp. Form.:
C22H28O3
Mol. Mass.:
340.4559
SMILES:
CCCOC(=O)C1=CC[C@H]2[C@@H]3CCc4cc(O)ccc4[C@H]3CC[C@]12C
: