Target
Poly [ADP-ribose] polymerase tankyrase-2
Ligand
BDBM435409
Substrate
Meas. Tech.
Biochemical Activity Assay
IC50
0.330±n/a nM
Citation
 Buchstaller, HDorsch, D 1,4-dicarbonyl-piperidyl derivatives US Patent  US10570116 Publication Date 2/25/2020 
Target
Name:
Poly [ADP-ribose] polymerase tankyrase-2
Synonyms:
(ARTD6 or PARP5b) Poly [ADP-ribose] polymerase tankyrase-2 TNKL TNKS2_HUMAN Tankyrase 2 Tankyrase-2 Tankyrase-2 (TNKS2)
Type:
Enzyme
Mol. Mass.:
126937.16
Organism:
Homo sapiens (Human)
Description:
Q9H2K2
Residue:
1166
  
Inhibitor
Name:
BDBM435409
Synonyms:
US10570116, Compound C17
Type:
Small organic molecule
Emp. Form.:
C23H30N6O3
Mol. Mass.:
438.5227
SMILES:
Cn1cc(cn1)C(=O)C1CCN(CC1)C(=O)CC(C)(C)Cc1nc2n(C)ccc2c(=O)[nH]1
: