Target
Poly [ADP-ribose] polymerase 1
Ligand
BDBM435434
Substrate
Meas. Tech.
Biochemical Activity
IC50
1100±n/a nM
Citation
 Buchstaller, HDorsch, D 1,4-dicarbonyl-piperidyl derivatives US Patent  US10570116 Publication Date 2/25/2020 
Target
Name:
Poly [ADP-ribose] polymerase 1
Synonyms:
(ARTD1 or PARP1) 2.4.2.30 ADPRT ARTD1 Human diphtheria toxin-like ADP-ribosyltransferase (ARTD1 or PARP1) NT-PARP-1 PARP1 PPOL Poly [ADP-ribose] polymerase 1 (PARP) Poly [ADP-ribose] polymerase 1 (PARP1) Poly [ADP-ribose] polymerase 1, 28-kDa form Poly [ADP-ribose] polymerase 1, processed C-terminus Poly [ADP-ribose] polymerase-1 Poly(ADP-ribose) polymerase-1 (ARTD1/PARP1) Protein poly-ADP-ribosyltransferase PARP1 | Synonyms=ADPRT
Type:
Mol. Mass.:
113114.22
Organism:
Homo sapiens (Human)
Description:
P09874
Residue:
1014
  
Inhibitor
Name:
BDBM435434
Synonyms:
US10570116, Compound C42
Type:
Small organic molecule
Emp. Form.:
C28H31N3O5
Mol. Mass.:
489.5628
SMILES:
COC(=O)c1cccc(c1)C(=O)C1CCN(CC1)C(=O)C[C@H](C)Cc1nc2c(C)cccc2c(=O)[nH]1
: