Target
Tyrosine-protein kinase BTK
Ligand
BDBM435447
Substrate
Meas. Tech.
Lanthscreen Eu Kinase Binding assay
IC50
4.00±n/a nM
Citation
 Bosanac, TBentzien, JBurke, MJDiSalvo, DTMao, WSoleymanzadeh, FWestbrook, JAXiong, Z Isoquinolones as BTK inhibitors US Patent  US10570118 Publication Date 2/25/2020 
Target
Name:
Tyrosine-protein kinase BTK
Synonyms:
AGMX1 Agammaglobulinaemia tyrosine kinase B cell progenitor kinase BPK BTK_HUMAN Tyrosine Kinase BTK Tyrosine-protein kinase BTK (BTK)
Type:
Enzyme
Mol. Mass.:
76289.95
Organism:
Homo sapiens (Human)
Description:
Q06187
Residue:
659
  
Inhibitor
Name:
BDBM435447
Synonyms:
US10570118, Example 2
Type:
Small organic molecule
Emp. Form.:
C32H32N4O4
Mol. Mass.:
536.6209
SMILES:
Cn1cc(cc1C(N)=O)-c1cccc(c1CO)-n1c(CC2CN(C2)C(=O)C=C)cc2cc(ccc2c1=O)C1CC1
: