Target
Tyrosine-protein kinase BTK
Ligand
BDBM435482
Substrate
Meas. Tech.
Lanthscreen Eu Kinase Binding assay
IC50
580±n/a nM
Citation
 Bosanac, TBentzien, JBurke, MJDiSalvo, DTMao, WSoleymanzadeh, FWestbrook, JAXiong, Z Isoquinolones as BTK inhibitors US Patent  US10570118 Publication Date 2/25/2020 
Target
Name:
Tyrosine-protein kinase BTK
Synonyms:
AGMX1 Agammaglobulinaemia tyrosine kinase B cell progenitor kinase BPK BTK_HUMAN Tyrosine Kinase BTK Tyrosine-protein kinase BTK (BTK)
Type:
Enzyme
Mol. Mass.:
76289.95
Organism:
Homo sapiens (Human)
Description:
Q06187
Residue:
659
  
Inhibitor
Name:
BDBM435482
Synonyms:
US10570118, Example 36
Type:
Small organic molecule
Emp. Form.:
C31H29N3O4
Mol. Mass.:
507.5797
SMILES:
CN(Cc1cc2cc(ccc2c(=O)n1-c1cccc(c1CO)-c1cccc(c1)C(N)=O)C1CC1)C(=O)C=C
: