Target
Histone-lysine N-methyltransferase EZH2
Ligand
BDBM435574
Substrate
Meas. Tech.
Biological Assay (10X SAM)
Ki
0.200±n/a nM
Citation
 Collins, MRKania, RSKumpf, RAKung, PRichter, DTSutton, SCWythes, MJ Substituted dihydroisoquinolinone compounds US Patent  US10570121 Publication Date 2/25/2020 
Target
Name:
Histone-lysine N-methyltransferase EZH2
Synonyms:
ENX-1 EZH2_HUMAN Histone-lysine N-methyltransferase EZH2 Lysine N-methyltransferase 6
Type:
Protein
Mol. Mass.:
85367.84
Organism:
Homo sapiens (Human)
Description:
Q15910
Residue:
746
  
Inhibitor
Name:
BDBM435574
Synonyms:
US10570121, Example 84 | US10570121, Example 85
Type:
Small organic molecule
Emp. Form.:
C24H29ClN2O5
Mol. Mass.:
460.95
SMILES:
COC(C1CCOC1)c1cc(C)c2CCN(Cc3c(OC)cc(C)[nH]c3=O)C(=O)c2c1Cl
: