Target
Histone-lysine N-methyltransferase EZH2
Ligand
BDBM435597
Substrate
Meas. Tech.
Biological Assay (10X SAM)
Ki
0.600±n/a nM
Citation
 Collins, MRKania, RSKumpf, RAKung, PRichter, DTSutton, SCWythes, MJ Substituted dihydroisoquinolinone compounds US Patent  US10570121 Publication Date 2/25/2020 
Target
Name:
Histone-lysine N-methyltransferase EZH2
Synonyms:
ENX-1 EZH2_HUMAN Histone-lysine N-methyltransferase EZH2 Lysine N-methyltransferase 6
Type:
Protein
Mol. Mass.:
85367.84
Organism:
Homo sapiens (Human)
Description:
Q15910
Residue:
746
  
Inhibitor
Name:
BDBM435597
Synonyms:
US10570121, Example 106
Type:
Small organic molecule
Emp. Form.:
C23H26Cl2N2O5
Mol. Mass.:
481.369
SMILES:
COc1cc(C)[nH]c(=O)c1CN1CCc2c(Cl)cc([C@H](CO)[C@@H]3CCCO3)c(Cl)c2C1=O
: