Target
Histone-lysine N-methyltransferase EZH2
Ligand
BDBM50246930
Substrate
Meas. Tech.
Biological Assay (10X SAM)
Ki
0.300±n/a nM
Citation
 Collins, MRKania, RSKumpf, RAKung, PRichter, DTSutton, SCWythes, MJ Substituted dihydroisoquinolinone compounds US Patent  US10570121 Publication Date 2/25/2020 
Target
Name:
Histone-lysine N-methyltransferase EZH2
Synonyms:
ENX-1 EZH2_HUMAN Histone-lysine N-methyltransferase EZH2 Lysine N-methyltransferase 6
Type:
Protein
Mol. Mass.:
85367.84
Organism:
Homo sapiens (Human)
Description:
Q15910
Residue:
746
  
Inhibitor
Name:
BDBM50246930
Synonyms:
CHEMBL4067961 | US10570121, Example 153
Type:
Small organic molecule
Emp. Form.:
C22H24Cl2N2O5S
Mol. Mass.:
499.407
SMILES:
COC(C1CS(=O)(=O)C1)c1cc(Cl)c2CCN(Cc3c(C)cc(C)[nH]c3=O)C(=O)c2c1Cl
: