Target
Rho-associated protein kinase 2
Ligand
BDBM141032
Substrate
Meas. Tech.
Binding Assay
IC50
4000±n/a nM
Citation
 Bartolozzi, ACampbell, SFoudoulakis, HKirk, BRam, SSweetnam, PSeshadri, H Pharmacokinetically improved compounds US Patent  US10570123 Publication Date 2/25/2020 
Target
Name:
Rho-associated protein kinase 2
Synonyms:
KIAA0619 ROCK2 Rho kinase 2 (ROCKII) Rho-associated protein kinase 2 (ROCK2) Rho-associated protein kinase 2/Transforming protein RhoA Rho-associated, coiled-coil-containing protein kinase II p164 ROCK-2
Type:
Protein
Mol. Mass.:
160885.43
Organism:
Homo sapiens (Human)
Description:
O75116
Residue:
1388
  
Inhibitor
Name:
BDBM141032
Synonyms:
US10570123, Example 243 | US8916576, 243
Type:
Small organic molecule
Emp. Form.:
C30H33N7O2
Mol. Mass.:
523.6287
SMILES:
CCCC(=O)Nc1cccc(c1)-c1nc(Nc2ccc3n(C)ncc3c2)c2cc(OCCN(C)C)ccc2n1
: