Target
Rho-associated protein kinase 2
Ligand
BDBM140994
Substrate
Meas. Tech.
Binding Assay
IC50
50.0±n/a nM
Citation
 Bartolozzi, ACampbell, SFoudoulakis, HKirk, BRam, SSweetnam, PSeshadri, H Pharmacokinetically improved compounds US Patent  US10570123 Publication Date 2/25/2020 
Target
Name:
Rho-associated protein kinase 2
Synonyms:
KIAA0619 ROCK2 Rho kinase 2 (ROCKII) Rho-associated protein kinase 2 (ROCK2) Rho-associated protein kinase 2/Transforming protein RhoA Rho-associated, coiled-coil-containing protein kinase II p164 ROCK-2
Type:
Protein
Mol. Mass.:
160885.43
Organism:
Homo sapiens (Human)
Description:
O75116
Residue:
1388
  
Inhibitor
Name:
BDBM140994
Synonyms:
US10570123, Example 160 | US8916576, 160
Type:
Small organic molecule
Emp. Form.:
C33H37N7O4
Mol. Mass.:
595.6914
SMILES:
CCCC(=O)Nc1cccc(c1)-c1nc(Nc2ccc3[nH]ncc3c2)c2cc(OCCCN3CCOCC3)c(OC)cc2n1
: