Target
Methylosome protein 50/Protein arginine N-methyltransferase 5
Ligand
BDBM435516
Substrate
Meas. Tech.
Biochemical Assay
IC50
1.90±n/a nM
Citation
 Lin, HLuengo, JShetty, RHawkins, M Selective inhibitors of protein arginine methyltransferase 5 (PRMT5) US Patent  US10570140 Publication Date 2/25/2020 
Target
Name:
Methylosome protein 50/Protein arginine N-methyltransferase 5
Synonyms:
PRMT5 PRMT5/MEP50 Enzyme | PRMT5/MEP50 complex
Type:
Protein
Mol. Mass.:
Description:
Components:
This complex has 2 components.
Component 1
Name:
Protein arginine N-methyltransferase 5
Synonyms:
72 kDa ICln-binding protein HRMT1L5 IBP72 Jak-binding protein 1 PRMT5/MEP50 complex Protein arginine methyltransferase 5 (PRMT5) SKB1 homolog Shk1 kinase-binding protein 1 homolog
Type:
Enzyme
Mol. Mass.:
72679.99
Organism:
Homo sapiens (Human)
Description:
O14744
Residue:
637
  
Component 2
Name:
Methylosome protein 50
Synonyms:
Androgen receptor cofactor p44 MEP50 Nbla10071 WD45 p44/Mep50
Type:
Enzyme
Mol. Mass.:
36713.38
Organism:
Homo sapiens (Human)
Description:
Q9BQA1
Residue:
342
  
Inhibitor
Name:
BDBM435516
Synonyms:
(2R,3S,4R,5R)-5-(4-amino-7H- pyrrolo[2,3-d]pyrimidin-7-yl)-2-(((2- aminoquinolin-7-yl)oxy)methyl)-3- (trifluoromethyl)tetrahydrofuran-3,4-diol US11078205, Example 2 | US11208416, Example 2
Type:
Small organic molecule
Emp. Form.:
C21H19F3N6O4
Mol. Mass.:
476.4086
SMILES:
Nc1ccc2ccc(OC[C@H]3O[C@H]([C@H](O)[C@@]3(O)C(F)(F)F)n3ccc4c(N)ncnc34)cc2n1
: