Target
cAMP and cAMP-inhibited cGMP 3',5'-cyclic phosphodiesterase 10A
Ligand
BDBM364326
Substrate
Meas. Tech.
In Vitro Pharmacology Assay
IC50
<10±n/a nM
Citation
 Campbell, JEJones, PWHewitt, MC Substituted imidazo[1,2-a]pyridines as PDE-10 inhibitors US Patent  US10570156 Publication Date 2/25/2020 
Target
Name:
cAMP and cAMP-inhibited cGMP 3',5'-cyclic phosphodiesterase 10A
Synonyms:
3',5'-cyclic phosphodiesterase PDE10_HUMAN Phosphodiesterase 10A
Type:
Protein
Mol. Mass.:
88412.52
Organism:
Homo sapiens (Human)
Description:
Q9Y233
Residue:
779
  
Inhibitor
Name:
BDBM364326
Synonyms:
US10570156, Compound 8 | US9856274, Compound 8
Type:
Small organic molecule
Emp. Form.:
C20H18N6
Mol. Mass.:
342.3971
SMILES:
Cc1cccc2nc(CCc3nc4c(ccc5ncccc45)n3C)nn12
: