Target
cAMP and cAMP-inhibited cGMP 3',5'-cyclic phosphodiesterase 10A
Ligand
BDBM364334
Substrate
Meas. Tech.
In Vitro Pharmacology Assay
IC50
<10±n/a nM
Citation
 Campbell, JEJones, PWHewitt, MC Substituted imidazo[1,2-a]pyridines as PDE-10 inhibitors US Patent  US10570156 Publication Date 2/25/2020 
Target
Name:
cAMP and cAMP-inhibited cGMP 3',5'-cyclic phosphodiesterase 10A
Synonyms:
3',5'-cyclic phosphodiesterase PDE10_HUMAN Phosphodiesterase 10A
Type:
Protein
Mol. Mass.:
88412.52
Organism:
Homo sapiens (Human)
Description:
Q9Y233
Residue:
779
  
Inhibitor
Name:
BDBM364334
Synonyms:
US10570156, Compound 16 | US9856274, Compound 16
Type:
Small organic molecule
Emp. Form.:
C19H17N7
Mol. Mass.:
343.3852
SMILES:
Cc1ccc(C)n2nc(CCc3nc4c5cccnc5ccn4n3)nc12
: