Target
5'-nucleotidase
Ligand
BDBM420016
Substrate
Meas. Tech.
Inhibition Enzyme In Vitro Assay
IC50
62.0±n/a nM
Citation
 Billedeau, RJLi, JChen, L Ectonucleotidase inhibitors and methods of use thereof US Patent  US10570167 Publication Date 2/25/2020 
Target
Name:
5'-nucleotidase
Synonyms:
5'-NT 5NTD_HUMAN Ecto-5'-nucleotidase NT5 NTE
Type:
Enzyme
Mol. Mass.:
63371.54
Organism:
Homo sapiens (Human)
Description:
P21589
Residue:
574
  
Inhibitor
Name:
BDBM420016
Synonyms:
US10472364, Compound 86 US11034715, Cpd. # 86 | US11208414, Cpd. # 86
Type:
Small organic molecule
Emp. Form.:
C20H20ClFN6O9S
Mol. Mass.:
574.924
SMILES:
Nc1nc(Cl)nc2n(cnc12)[C@@H]1O[C@H](COC(Cc2ccc(cc2)S(N)(=O)=O)(C(O)=O)C(O)=O)[C@@H](O)[C@@H]1F
: