Target
5'-nucleotidase
Ligand
BDBM435795
Substrate
Meas. Tech.
Inhibition Enzyme In Vitro Assay
IC50
104±n/a nM
Citation
 Billedeau, RJLi, JChen, L Ectonucleotidase inhibitors and methods of use thereof US Patent  US10570167 Publication Date 2/25/2020 
Target
Name:
5'-nucleotidase
Synonyms:
5'-NT 5NTD_HUMAN Ecto-5'-nucleotidase NT5 NTE
Type:
Enzyme
Mol. Mass.:
63371.54
Organism:
Homo sapiens (Human)
Description:
P21589
Residue:
574
  
Inhibitor
Name:
BDBM435795
Synonyms:
US10570167, Cpd. # 108 | US11034715, Cpd. # 108
Type:
Small organic molecule
Emp. Form.:
C20H16ClF4N5O7
Mol. Mass.:
549.817
SMILES:
Nc1nc(Cl)nc2n(cnc12)[C@@H]1O[C@H](COC(Cc2ccc(F)c(F)c2F)(C(O)=O)C(O)=O)[C@@H](O)[C@@H]1F
: