Target
Prolyl endopeptidase-like
Ligand
BDBM298353
Substrate
Meas. Tech.
POP Inhibition Assays
IC50
339±138.5 nM
Citation
 Giralt Lledó, ETarragó Clua, TPrades Cosano, RRoyo Gracia, S 1-[1-(benzoyl)-pyrrolidine-2-carbonyl]-pyrrolidine-2-carbonitrile derivatives US Patent  US10611727 Publication Date 4/7/2020 
Target
Name:
Prolyl endopeptidase-like
Synonyms:
KIAA0436 PREPL | Prolylendopeptidase-like
Type:
Protein
Mol. Mass.:
83923.47
Organism:
Human
Description:
Q4J6C6
Residue:
727
  
Inhibitor
Name:
BDBM298353
Synonyms:
(S)-1-((2S,4S)-1-(4-(benzyloxy)-3,5-dimethoxybenzoyl)-4-phenylpyrrolidine-2-carbonyl)pyrrolidine-2-carbonitrile US10611727, Example 3
Type:
Small organic molecule
Emp. Form.:
C32H33N3O5
Mol. Mass.:
539.6215
SMILES:
COc1cc(cc(OC)c1OCc1ccccc1)C(=O)N1C[C@@H](C[C@H]1C(=O)N1CCC[C@H]1C#N)c1ccccc1
: