Target
Sigma intracellular receptor 2
Ligand
BDBM349506
Substrate
Meas. Tech.
Competitive Radioligand Binding Assay
Ki
12.0±n/a nM
Citation
 Rishton, GMCatalano, SMLook, GC Isoindoline compositions and methods for treating neurodegenerative disease US Patent  US10611728 Publication Date 4/7/2020 
Target
Name:
Sigma intracellular receptor 2
Synonyms:
MAC30 S2R Sigma-2 receptor TMEM97 | Transmembrane protein 97
Type:
Protein
Mol. Mass.:
20857.20
Organism:
Homo sapiens (Human)
Description:
Q5BJF2
Residue:
176
  
Inhibitor
Name:
BDBM349506
Synonyms:
US10207991, Ex. Cpd. No. 21 US11691947, Example 21
Type:
Small organic molecule
Emp. Form.:
C18H19F2N
Mol. Mass.:
287.347
SMILES:
C[C@H](CCc1ccc(F)cc1)N1Cc2cccc(F)c2C1
: