Target
Voltage-dependent calcium channel gamma-8 subunit
Ligand
BDBM435950
Substrate
Meas. Tech.
Calcium Flux Assay
IC50
7.94±n/a nM
Citation
 Ameriks, MKRavula, SSwanson, DMSavall, BM Benzimidazolone and benzothiazolone compounds and their use as AMPA receptor modulators US Patent  US10611730 Publication Date 4/7/2020 
Target
Name:
Voltage-dependent calcium channel gamma-8 subunit
Synonyms:
CACNG6 CCG8_HUMAN TARP gamma-8 | Transmembrane AMPAR regulatory protein gamma-8
Type:
Enzyme Catalytic Domain
Mol. Mass.:
43326.96
Organism:
Homo sapiens (Human)
Description:
Q8WXS5
Residue:
425
  
Inhibitor
Name:
BDBM435950
Synonyms:
2-[3,4-Dichloro-2-(2-oxo-1,3-dihydrobenzimidazol-5-yl)phenyl]acetonitrile; | US10611730, Example 122
Type:
Small organic molecule
Emp. Form.:
C15H9Cl2N3O
Mol. Mass.:
318.157
SMILES:
Clc1ccc(CC#N)c(c1Cl)-c1ccc2[nH]c(=O)[nH]c2c1
: