Target
Phosphatidylinositol 3-kinase regulatory subunit beta
Ligand
BDBM350421
Substrate
Meas. Tech.
Fluorescent Determination of PI3K Enzyme Activity
IC50
277±n/a nM
Citation
 Su, WDai, GZhang, WDeng, W Imidazopyridazine compounds and their use US Patent  US10611777 Publication Date 4/7/2020 
Target
Name:
Phosphatidylinositol 3-kinase regulatory subunit beta
Synonyms:
P85B_HUMAN PI3-kinase subunit p85-beta PIK3R2 PtdIns-3-kinase regulatory subunit beta | PtdIns-3-kinase regulatory subunit p85-beta
Type:
Enzyme Subunit
Mol. Mass.:
81542.75
Organism:
Homo sapiens (Human)
Description:
O00459
Residue:
728
  
Inhibitor
Name:
BDBM350421
Synonyms:
US10208066, Compound 40 | US10611777, Compound 40
Type:
Small organic molecule
Emp. Form.:
C18H15Cl2N7
Mol. Mass.:
400.265
SMILES:
C[C@H](Nc1ncnc(N)c1Cl)c1cc2ncc(Cl)n2nc1-c1ccccc1
: