Target
Phosphatidylinositol 4,5-bisphosphate 3-kinase catalytic subunit delta isoform
Ligand
BDBM350432
Substrate
Meas. Tech.
Fluorescent Determination of PI3K Enzyme Activity
IC50
80.0±n/a nM
Citation
 Su, WDai, GZhang, WDeng, W Imidazopyridazine compounds and their use US Patent  US10611777 Publication Date 4/7/2020 
Target
Name:
Phosphatidylinositol 4,5-bisphosphate 3-kinase catalytic subunit delta isoform
Synonyms:
PI3-kinase p110 subunit delta PI3-kinase subunit p110-delta PIK3CD Phosphatidylinositol 4,5-biphosphate 3-kinase catalytic subunit delta (PIK3CD) Phosphatidylinositol 4,5-bisphosphate 3-kinase 110 kDa catalytic subunit delta (PI3K delta) Phosphatidylinositol 4,5-bisphosphate 3-kinase catalytic subunit delta (PI3Kdelta) Phosphatidylinositol 4,5-bisphosphate 3-kinase catalytic subunit delta isoform (PI3K delta) Phosphatidylinositol 4,5-bisphosphate 3-kinase catalytic subunit delta isoform (PI3K-delta) Phosphatidylinositol 4,5-bisphosphate 3-kinase catalytic subunit delta isoform (PI3Kdelta)
Type:
Enzyme Subunit
Mol. Mass.:
119489.41
Organism:
Homo sapiens (Human)
Description:
O00329
Residue:
1044
  
Inhibitor
Name:
BDBM350432
Synonyms:
(S)-4-amino-6-((1-(3-chloro-6-phenylimidazo[1,2-b]pyridazin-7-yl)ethyl)amino)pyrimidine-5-carboxylic acid US10208066, Compound 53 | US10611777, Compound 53
Type:
Small organic molecule
Emp. Form.:
C19H16ClN7O2
Mol. Mass.:
409.829
SMILES:
C[C@H](Nc1ncnc(N)c1C(O)=O)c1cc2ncc(Cl)n2nc1-c1ccccc1
: