Target
Phosphatidylinositol 4,5-bisphosphate 3-kinase catalytic subunit gamma isoform
Ligand
BDBM350446
Substrate
Meas. Tech.
Fluorescent Determination of PI3K Enzyme Activity
IC50
345±n/a nM
Citation
 Su, WDai, GZhang, WDeng, W Imidazopyridazine compounds and their use US Patent  US10611777 Publication Date 4/7/2020 
Target
Name:
Phosphatidylinositol 4,5-bisphosphate 3-kinase catalytic subunit gamma isoform
Synonyms:
PI3-kinase p110 subunit gamma PI3Kgamma PK3CG_HUMAN Phosphatidylinositol 4,5-bisphosphate 3-kinase (PI3K) Phosphatidylinositol 4,5-bisphosphate 3-kinase catalytic subunit gamma (PI3Kgamma) Phosphatidylinositol 4,5-bisphosphate 3-kinase catalytic subunit gamma isoform (PI3K) Phosphatidylinositol-4,5-bisphosphate 3-kinase catalytic subunit gamma isoform Phosphoinositide 3-kinases gamma (PI3K gamma) p120-PI3K
Type:
Enzyme Subunit
Mol. Mass.:
126470.30
Organism:
Homo sapiens (Human)
Description:
P48736
Residue:
1102
  
Inhibitor
Name:
BDBM350446
Synonyms:
US10208066, Compound 68 | US10611777, Compound 68
Type:
Small organic molecule
Emp. Form.:
C20H17ClN8O2S
Mol. Mass.:
468.919
SMILES:
C[C@H](Nc1ncnc(N)c1C#N)c1cc2ncc(Cl)n2nc1-c1ccccc1S(C)(=O)=O
: