Target
Programmed cell death protein 1
Ligand
BDBM436169
Substrate
Meas. Tech.
Homogenous Time-Resolved Fluorescence (HTRF) Binding Assay
IC50
5±n/a nM
Citation
 Yeung, KGrant-Young, KAZhu, JSaulnier, MGFrennesson, DBMeng, ZScola, PM 1,3-dihydroxy-phenyl derivatives useful as immunomodulators US Patent  US10590105 Publication Date 3/17/2020 
Target
Name:
Programmed cell death protein 1
Synonyms:
CD_antigen=CD279 PDCD1 Programmed cell death protein 1 hPD-1
Type:
PROTEIN
Mol. Mass.:
31650.07
Organism:
Homo sapiens
Description:
ChEMBL_108437
Residue:
288
  
Inhibitor
Name:
BDBM436169
Synonyms:
US10590105, Example 2012
Type:
Small organic molecule
Emp. Form.:
C39H44ClN5O7
Mol. Mass.:
730.249
SMILES:
Cc1c(COc2cc(OCc3cncc(c3)C#N)c(CN[C@@](C)(CO)C(O)=O)cc2Cl)nccc1-c1cccc(OCCCN2CC[C@@H](O)C2)c1C
: