Target
Fibroblast growth factor receptor 3 [399-806]
Ligand
BDBM436206
Substrate
Meas. Tech.
Inhibition Assay
IC50
>1000±n/a nM
Citation
 Kong, NXZhou, CZheng, Z Heterocyclic compounds used as FGFR inhibitors US Patent  US10590109 Publication Date 3/17/2020 
Target
Name:
Fibroblast growth factor receptor 3 [399-806]
Synonyms:
FGFR3 Fibroblast growth factor receptor 3 (FGFR3)(aa 399-806) | JTK4
Type:
Enzyme Catalytic Domain
Mol. Mass.:
45160.69
Organism:
Homo sapiens (Human)
Description:
aa 399-806
Residue:
408
  
Inhibitor
Name:
BDBM436206
Synonyms:
US10590109, Compound 24
Type:
Small organic molecule
Emp. Form.:
C24H29N7O5
Mol. Mass.:
495.531
SMILES:
COC[C@H](C)Oc1cc(NC(=O)N(C)c2ccc(CN3CCN(C)CC3=O)c(C=O)n2)ncc1C#N
: