Target
Leucine-rich repeat serine/threonine-protein kinase 2
Ligand
BDBM384499
Substrate
Meas. Tech.
Biochemical Assay
IC50
<30±n/a nM
Citation
 Estrada, AAFeng, JALyssikatos, JPSweeney, ZKde Vicente Fidalgo, J Compounds, compositions, and methods US Patent  US10590114 Publication Date 3/17/2020 
Target
Name:
Leucine-rich repeat serine/threonine-protein kinase 2
Synonyms:
Dardarin LRRK2_HUMAN Leucine-rich repeat serine/threonine-protein kinase 2 PARK8
Type:
Protein
Mol. Mass.:
286113.20
Organism:
Homo sapiens (Human)
Description:
Q5S007
Residue:
2527
  
Inhibitor
Name:
BDBM384499
Synonyms:
US10590114, No. 185 US11591316, Compound 185 | US9932325, Example 185
Type:
Small organic molecule
Emp. Form.:
C16H17F3N6O2
Mol. Mass.:
382.3404
SMILES:
CCNc1nc(Nc2cc(nn2C)[C@]23C[C@H]2COC3=O)ncc1C(F)(F)F
: