Target
Potassium voltage-gated channel subfamily H member 2
Ligand
BDBM300960
Substrate
Meas. Tech.
Binding Assay
IC50
6.70±n/a nM
Citation
 Barlaam, BCO Donovan, DHHughes, SJMoss, TANissink, JWScott, JSYang, B Chemical compounds US Patent  US10590130 Publication Date 3/17/2020 
Target
Name:
Potassium voltage-gated channel subfamily H member 2
Synonyms:
1,3-beta-glucan synthase component GLS2 ERG Eag-related protein 1 Ether-a-go-go-related gene (HERG) Ether-a-go-go-related gene potassium channel 1 Ether-a-go-go-related gene potassium channel 1 (hERG1) Ether-a-go-go-related protein 1 H-ERG KCNH2 Potassium voltage-gated channel subfamily H member 2 (hERG) Voltage-gated potassium channel subunit Kv11.1 hERG Potassium Channel 1 | putative potassium channel subunit
Type:
Multi-pass membrane protein
Mol. Mass.:
126672.65
Organism:
Homo sapiens (Human)
Description:
Q12809
Residue:
1159
  
Inhibitor
Name:
BDBM300960
Synonyms:
(6S,8R)-7-(2,2-difluoroethyl)-6-(5-((1-(3-fluoropropyl)azetidin-3-yl)oxy)pyridin-2-yl)-8-methyl-6,7,8,9-tetrahydro-3H-pyrazolo[4,3-f]isoquinoline US10590130, Example 26 | US10961241, Example 26
Type:
Small organic molecule
Emp. Form.:
C24H28F3N5O
Mol. Mass.:
459.5072
SMILES:
C[C@@H]1Cc2c(ccc3[nH]ncc23)[C@H](N1CC(F)F)c1ccc(OC2CN(CCCF)C2)cn1
: