Target
Estrogen receptor [307-554]
Ligand
BDBM300953
Substrate
Meas. Tech.
Binding Assay
IC50
5400±n/a nM
Citation
 Barlaam, BCO Donovan, DHHughes, SJMoss, TANissink, JWScott, JSYang, B Chemical compounds US Patent  US10590130 Publication Date 3/17/2020 
Target
Name:
Estrogen receptor [307-554]
Synonyms:
ESR ESR1_HUMAN NR3A1
Type:
Enzyme Catalytic Domain
Mol. Mass.:
28281.50
Organism:
Homo sapiens (Human)
Description:
aa 307-554
Residue:
248
  
Inhibitor
Name:
BDBM300953
Synonyms:
N-(4-((6S,8R)-7-(2,2-difluoropropyl)-8-methyl-6,7,8,9-tetrahydro-3H-pyrazolo[4,3-f]isoquinolin-6-yl)-3-methoxyphenyl)-1-(3-fluoropropyl)azetidin-3-amine US10590130, Example 19 | US10961241, Example 19
Type:
Small organic molecule
Emp. Form.:
C27H34F3N5O
Mol. Mass.:
501.587
SMILES:
COc1cc(NC2CN(CCCF)C2)ccc1[C@H]1N(CC(C)(F)F)[C@H](C)Cc2c1ccc1[nH]ncc21
: