Target
Estrogen receptor [307-554]
Ligand
BDBM300967
Substrate
Meas. Tech.
Binding Assay
IC50
14000±n/a nM
Citation
 Barlaam, BCO Donovan, DHHughes, SJMoss, TANissink, JWScott, JSYang, B Chemical compounds US Patent  US10590130 Publication Date 3/17/2020 
Target
Name:
Estrogen receptor [307-554]
Synonyms:
ESR ESR1_HUMAN NR3A1
Type:
Enzyme Catalytic Domain
Mol. Mass.:
28281.50
Organism:
Homo sapiens (Human)
Description:
aa 307-554
Residue:
248
  
Inhibitor
Name:
BDBM300967
Synonyms:
5-Fluoro-6-((6S,8R)-1-fluoro-8-methyl-7-(2,2,2-trifluoroethyl)-6,7,8,9-tetrahydro-3H-pyrazolo[4,3-f]isoquinolin-6-yl)-N-(1-(3-fluoropropyl)azetidin-3-yl)pyridin-3-amine US10590130, Example 33 | US10961241, Example 33
Type:
Small organic molecule
Emp. Form.:
C24H26F6N6
Mol. Mass.:
512.4939
SMILES:
C[C@@H]1Cc2c(ccc3[nH]nc(F)c23)[C@H](N1CC(F)(F)F)c1ncc(NC2CN(CCCF)C2)cc1F
: