Target
High affinity nerve growth factor receptor
Ligand
BDBM200606
Substrate
Meas. Tech.
ELISA Assay
IC50
176±n/a nM
Citation
 Andrews, SWHaas, JJiang, YZhang, G Method of treatment using substituted imidazo[1,2b]pyridazine compounds US Patent  US10590139 Publication Date 3/17/2020 
Target
Name:
High affinity nerve growth factor receptor
Synonyms:
2.7.10.1 NTRK1 NTRK1_HUMAN Neurotrophic tyrosine kinase receptor type 1 Synonyms=MTC TRK1-transforming tyrosine kinase protein TRKA GN Trk-A Tropomyosin-related kinase A Tyrosine kinase receptor Tyrosine kinase receptor A Tyrosine kinase receptor A (Trk-A) gp140trk | p140-TrkA
Type:
Mol. Mass.:
87498.18
Organism:
Homo sapiens (Human)
Description:
P04629
Residue:
796
  
Inhibitor
Name:
BDBM200606
Synonyms:
US10011604, 32 US9227975, 32 | US9796723, 32
Type:
Small organic molecule
Emp. Form.:
C26H26F2N6O4
Mol. Mass.:
524.5192
SMILES:
COc1cc(NC(=O)Nc2cnc3ccc(nn23)N2CCC[C@@H]2c2cc(F)ccc2F)cc(OC)c1OC
: