Target
High affinity nerve growth factor receptor
Ligand
BDBM200636
Substrate
Meas. Tech.
ELISA Assay
IC50
22.0±n/a nM
Citation
 Andrews, SWHaas, JJiang, YZhang, G Method of treatment using substituted imidazo[1,2b]pyridazine compounds US Patent  US10590139 Publication Date 3/17/2020 
Target
Name:
High affinity nerve growth factor receptor
Synonyms:
2.7.10.1 NTRK1 NTRK1_HUMAN Neurotrophic tyrosine kinase receptor type 1 Synonyms=MTC TRK1-transforming tyrosine kinase protein TRKA GN Tropomyosin alpha-3 chain/High affinity nerve growth factor receptor Tropomyosin-related kinase A (TrkA) Tyrosine kinase receptor (Trk) Tyrosine kinase receptor A (Trk A) Tyrosine kinase receptor A (TrkA) p140-TrkA
Type:
Mol. Mass.:
87498.18
Organism:
Homo sapiens (Human)
Description:
P04629
Residue:
796
  
Inhibitor
Name:
BDBM200636
Synonyms:
US10590139, Example 60 US9796723, 60
Type:
Small organic molecule
Emp. Form.:
C18H14F5N5O
Mol. Mass.:
411.3287
SMILES:
Fc1ccc(F)c(c1)[C@H]1CCCN1c1ccc2ncc(NC(=O)C(F)(F)F)n2n1
: