Target
Sodium-dependent noradrenaline transporter
Ligand
BDBM436407
Substrate
Meas. Tech.
Binding Assay
Ki
300±n/a nM
Citation
 Cuevas-Cordobés, FAlmansa-Rosales, C Tetrahydropyrimidodiazepine and dihydropyridodiazepine compounds for treating pain and pain related conditions US Patent  US10590140 Publication Date 3/17/2020 
Target
Name:
Sodium-dependent noradrenaline transporter
Synonyms:
Monoamine transporter NET Noradrenaline Transporter (NET) Norepinephrine transporter protein (NET) SLC6A2 Sodium-dependent noradrenaline transporter (NET) | Solute carrier family 6 member 2
Type:
Multi-pass membrane protein
Mol. Mass.:
69337.72
Organism:
Homo sapiens (Human)
Description:
P23975
Residue:
617
  
Inhibitor
Name:
BDBM436407
Synonyms:
6-(3-(4- ((benzylamino)methyl)- 1H-1,2,3-triazol-1- yl)phenyl)-2- (ethylamino)-9-methyl- 6,7,8,9-tetrahydro-5H- pyrimido[4,5- e][1,4]diazepin-5-one | US10590140, Example 182
Type:
Small organic molecule
Emp. Form.:
C26H29N9O
Mol. Mass.:
483.5682
SMILES:
CCNc1ncc2c(n1)N(C)CCN(c1cccc(c1)-n1cc(CNCc3ccccc3)nn1)C2=O
: