Target
Sodium-dependent noradrenaline transporter
Ligand
BDBM436609
Substrate
Meas. Tech.
Binding Assay
Ki
300±n/a nM
Citation
 Cuevas-Cordobés, FAlmansa-Rosales, C Tetrahydropyrimidodiazepine and dihydropyridodiazepine compounds for treating pain and pain related conditions US Patent  US10590140 Publication Date 3/17/2020 
Target
Name:
Sodium-dependent noradrenaline transporter
Synonyms:
Monoamine transporter NET Noradrenaline Transporter (NET) Norepinephrine transporter protein (NET) SLC6A2 Sodium-dependent noradrenaline transporter (NET) | Solute carrier family 6 member 2
Type:
Multi-pass membrane protein
Mol. Mass.:
69337.72
Organism:
Homo sapiens (Human)
Description:
P23975
Residue:
617
  
Inhibitor
Name:
BDBM436609
Synonyms:
(S)-8-methoxy-1- methyl-4-(4-(3- (methylamino)-1- (thiophen-2- yl)propoxy)benzyl)- 1,2,3,4-tetrahydro- 5H-pyrido[4,3- e][1,4]diazepin-5-one | US10590140, Example 385
Type:
Small organic molecule
Emp. Form.:
C25H30N4O3S
Mol. Mass.:
466.596
SMILES:
CNCC[C@H](Oc1ccc(CN2CCN(C)c3cc(OC)ncc3C2=O)cc1)c1cccs1
: