Target
Cannabinoid receptor 1
Ligand
BDBM286103
Substrate
Meas. Tech.
competition displacement assays
IC50
>1000±n/a nM
Citation
 McElroy, JFChorvat, RJ Cannabinoid receptor antagonists/inverse agonists useful for treating metabolic disorders, including obesity and diabetes US Patent  US10617673 Publication Date 4/14/2020 
Target
Name:
Cannabinoid receptor 1
Synonyms:
Brain-type cannabinoid receptor CB-R CNR1_MOUSE Cannabinoid receptor | Cnr1
Type:
Enzyme
Mol. Mass.:
52842.52
Organism:
Mus musculus (Mouse)
Description:
P47746
Residue:
473
  
Inhibitor
Name:
BDBM286103
Synonyms:
US10617673, Example 2a (2S,3R,4'R) US9517228, Example 2a | US9987253, Example 2a
Type:
Small organic molecule
Emp. Form.:
C26H25Cl2N5O4S
Mol. Mass.:
574.479
SMILES:
C[C@@H](O)[C@H](N\C(=N/S(=O)(=O)c1ccc(Cl)cc1)N1C[C@H](C(=N1)c1ccc(Cl)cc1)c1ccccc1)C(N)=O
: