Target
Glutamate receptor ionotropic, NMDA 2B
Ligand
BDBM436696
Substrate
Meas. Tech.
Standard cell-based calcium flux assay
IC50
10.00±n/a nM
Citation
 Chrovian, CCLetavic, MARech, JCRudolph, DASoyode-Johnson, AStenne, BMWall, JL Substituted 1H-imidazo[4,5-b]pyridin-2(3H)-ones and their use as GluN2B receptor modulators US Patent  US10617676 Publication Date 4/14/2020 
Target
Name:
Glutamate receptor ionotropic, NMDA 2B
Synonyms:
GRIN2B Glutamate [NMDA] receptor subunit epsilon 2 N-methyl D-aspartate receptor subtype 2B NMDAR2B NR3 | hNR3
Type:
PROTEIN
Mol. Mass.:
166375.46
Organism:
Homo sapiens (Human)
Description:
ChEMBL_1438829
Residue:
1484
  
Inhibitor
Name:
BDBM436696
Synonyms:
1-[2-(Azetidin-1-yl)-2-oxo-ethyl]-3-methyl-6-[5-(trifluoromethyl)-2- thienyl]imidazo[4,5-b]pyridin-2-one US10617676, Example 27 | US11207298, Example 120
Type:
Small organic molecule
Emp. Form.:
C17H15F3N4O2S
Mol. Mass.:
396.387
SMILES:
Cn1c2ncc(cc2n(CC(=O)N2CCC2)c1=O)-c1ccc(s1)C(F)(F)F
: