Target
Glutamate receptor ionotropic, NMDA 2B
Ligand
BDBM437053
Substrate
Meas. Tech.
Standard cell-based calcium flux assay
IC50
17.0±n/a nM
Citation
 Chrovian, CCLetavic, MARech, JCRudolph, DASoyode-Johnson, AStenne, BMWall, JL Substituted 1H-imidazo[4,5-b]pyridin-2(3H)-ones and their use as GluN2B receptor modulators US Patent  US10617676 Publication Date 4/14/2020 
Target
Name:
Glutamate receptor ionotropic, NMDA 2B
Synonyms:
GRIN2B Glutamate [NMDA] receptor subunit epsilon 2 N-methyl D-aspartate receptor subtype 2B NMDAR2B NR3 | hNR3
Type:
PROTEIN
Mol. Mass.:
166375.46
Organism:
Homo sapiens (Human)
Description:
ChEMBL_1438829
Residue:
1484
  
Inhibitor
Name:
BDBM437053
Synonyms:
6-(4-Fluoro-3-methyl-phenyl)-3-methyl-1-(2-oxobutyl)imidazo[4,5-b]pyridin- 2-one US11207298, Example 389
Type:
Small organic molecule
Emp. Form.:
C18H18FN3O2
Mol. Mass.:
327.3528
SMILES:
CCC(=O)Cn1c2cc(cnc2n(C)c1=O)-c1ccc(F)c(C)c1
: