Target
CREB-binding protein
Ligand
BDBM437608
Substrate
Meas. Tech.
In Vitro CBP Inhibition
IC50
<500±n/a nM
Citation
 Trzoss, LBetancort, JMKanouni, TWallace, MBBoloor, A Therapeutic compounds US Patent  US10617680 Publication Date 4/14/2020 
Target
Name:
CREB-binding protein
Synonyms:
CBP CREB-binding protein (CBP) CREBBP
Type:
Transcription Coactivator
Mol. Mass.:
265411.66
Organism:
Homo sapiens (Human)
Description:
Q92793
Residue:
2442
  
Inhibitor
Name:
BDBM437608
Synonyms:
2-chloro-6-(4-(6-(ethylamino)-1'-methyl-6'-oxo-1',6'- dihydro-[3,4'-bipyridin]-3'-yl)-1H-pyrazol-1- yl)benzonitrile US11020380, Example 342
Type:
Small organic molecule
Emp. Form.:
C23H19ClN6O
Mol. Mass.:
430.89
SMILES:
CCNc1ccc(cn1)-c1cc(=O)n(C)cc1-c1cnn(c1)-c1cccc(Cl)c1C#N
: