Target
Tyrosine-protein kinase ITK/TSK
Ligand
BDBM397203
Substrate
Meas. Tech.
Omnia Assay Protocol
IC50
<10±n/a nM
Citation
 Singh, JPetter, RCTester, RWKluge, AFMazdiyasni, HWestlin, III, WFNiu, DQiao, L 2,4-disubstituted pyrimidines useful as kinase inhibitors US Patent  US10596172 Publication Date 3/24/2020 
Target
Name:
Tyrosine-protein kinase ITK/TSK
Synonyms:
EMT ITK_HUMAN LYK Tyrosine-protein kinase ITK Tyrosine-protein kinase Lyk
Type:
Protein
Mol. Mass.:
71839.20
Organism:
Homo sapiens (Human)
Description:
Q08881
Residue:
620
  
Inhibitor
Name:
BDBM397203
Synonyms:
US10596172, Compound I-147 US11351168, Compound I-147 | US9987276, Compound I-147
Type:
Small organic molecule
Emp. Form.:
C18H19ClFN5O
Mol. Mass.:
375.828
SMILES:
Fc1cnc(Nc2cccc(Cl)c2)nc1N[C@@H]1CCCN(C1)C(=O)C=C
: