Target
Epidermal growth factor receptor
Ligand
BDBM397211
Substrate
Meas. Tech.
Omnia Assay Protocol
IC50
<10±n/a nM
Citation
 Singh, JPetter, RCTester, RWKluge, AFMazdiyasni, HWestlin, III, WFNiu, DQiao, L 2,4-disubstituted pyrimidines useful as kinase inhibitors US Patent  US10596172 Publication Date 3/24/2020 
Target
Name:
Epidermal growth factor receptor
Synonyms:
EGF Receptor Substrate EGFR_HUMAN ERBB1 Epidermal Growth Factor Receptor erbB-1 Epidermal growth factor receptor (EGFR) HER1 Proto-oncogene c-ErbB-1 Tyrosine-Protein Kinase ErbB-1
Type:
Receptor Kinase Domain
Mol. Mass.:
134279.59
Organism:
Homo sapiens (Human)
Description:
P00533
Residue:
1210
  
Inhibitor
Name:
BDBM397211
Synonyms:
US10596172, Compound I-156 US11351168, Compound I-156 | US9987276, Compound I-156
Type:
Small organic molecule
Emp. Form.:
C20H16FN7O
Mol. Mass.:
389.3857
SMILES:
Fc1cnc(Nc2ccc3[nH]ncc3c2)nc1Nc1cccc(NC(=O)C=C)c1
: