Target
Phosphatidylinositol 4,5-bisphosphate 3-kinase catalytic subunit delta isoform
Ligand
BDBM281477
Substrate
Meas. Tech.
Scintillation Proximity Assay
IC50
<5000±n/a nM
Citation
 Zou, GCombs, AP Aza-heteroaryl compounds as PI3K-gamma inhibitors US Patent  US10596184 Publication Date 3/24/2020 
Target
Name:
Phosphatidylinositol 4,5-bisphosphate 3-kinase catalytic subunit delta isoform
Synonyms:
PI3-kinase p110 subunit delta PI3-kinase subunit p110-delta PIK3CD Phosphatidylinositol 4,5-biphosphate 3-kinase catalytic subunit delta (PIK3CD) Phosphatidylinositol 4,5-bisphosphate 3-kinase 110 kDa catalytic subunit delta (PI3K delta) Phosphatidylinositol 4,5-bisphosphate 3-kinase catalytic subunit delta (PI3Kdelta) Phosphatidylinositol 4,5-bisphosphate 3-kinase catalytic subunit delta isoform (PI3K delta) Phosphatidylinositol 4,5-bisphosphate 3-kinase catalytic subunit delta isoform (PI3K-delta) Phosphatidylinositol 4,5-bisphosphate 3-kinase catalytic subunit delta isoform (PI3Kdelta)
Type:
Enzyme Subunit
Mol. Mass.:
119489.41
Organism:
Homo sapiens (Human)
Description:
O00329
Residue:
1044
  
Inhibitor
Name:
BDBM281477
Synonyms:
US10022387, Example 2 US9586949, Example 2
Type:
Small organic molecule
Emp. Form.:
C16H12N4O2
Mol. Mass.:
292.2921
SMILES:
COc1cncc(c1)-c1ccc2nc(oc2c1)-c1cnc[nH]1
: