Target
Phosphatidylinositol 4,5-bisphosphate 3-kinase catalytic subunit gamma isoform
Ligand
BDBM281495
Substrate
Meas. Tech.
Scintillation Proximity Assay
IC50
<250±n/a nM
Citation
 Zou, GCombs, AP Aza-heteroaryl compounds as PI3K-gamma inhibitors US Patent  US10596184 Publication Date 3/24/2020 
Target
Name:
Phosphatidylinositol 4,5-bisphosphate 3-kinase catalytic subunit gamma isoform
Synonyms:
PI3-kinase p110 subunit gamma PI3Kgamma PK3CG_HUMAN Phosphatidylinositol 4,5-bisphosphate 3-kinase (PI3K) Phosphatidylinositol 4,5-bisphosphate 3-kinase catalytic subunit gamma (PI3Kgamma) Phosphatidylinositol 4,5-bisphosphate 3-kinase catalytic subunit gamma isoform (PI3K) Phosphatidylinositol-4,5-bisphosphate 3-kinase catalytic subunit gamma isoform Phosphoinositide 3-kinases gamma (PI3K gamma) p120-PI3K
Type:
Enzyme Subunit
Mol. Mass.:
126470.30
Organism:
Homo sapiens (Human)
Description:
P48736
Residue:
1102
  
Inhibitor
Name:
BDBM281495
Synonyms:
N'-{5-[2-(1H- Benzimidazol-2- yl)-1,3- benzoxazol-6-yl]- pyridin-3-yl}-N,N- dimethylsulfamide US10596184, Example 21 | US9586949, Example 21
Type:
Small organic molecule
Emp. Form.:
C21H18N6O3S
Mol. Mass.:
434.471
SMILES:
CN(C)S(=O)(=O)Nc1cncc(c1)-c1ccc2nc(oc2c1)-c1nc2ccccc2[nH]1
: