Target
Phosphatidylinositol 4,5-bisphosphate 3-kinase catalytic subunit delta isoform
Ligand
BDBM281503
Substrate
Meas. Tech.
Scintillation Proximity Assay
IC50
<250±n/a nM
Citation
 Zou, GCombs, AP Aza-heteroaryl compounds as PI3K-gamma inhibitors US Patent  US10596184 Publication Date 3/24/2020 
Target
Name:
Phosphatidylinositol 4,5-bisphosphate 3-kinase catalytic subunit delta isoform
Synonyms:
PI3-kinase p110 subunit delta PI3-kinase subunit p110-delta PIK3CD Phosphatidylinositol 4,5-biphosphate 3-kinase catalytic subunit delta (PIK3CD) Phosphatidylinositol 4,5-bisphosphate 3-kinase 110 kDa catalytic subunit delta (PI3K delta) Phosphatidylinositol 4,5-bisphosphate 3-kinase catalytic subunit delta (PI3Kdelta) Phosphatidylinositol 4,5-bisphosphate 3-kinase catalytic subunit delta isoform (PI3K delta) Phosphatidylinositol 4,5-bisphosphate 3-kinase catalytic subunit delta isoform (PI3K-delta) Phosphatidylinositol 4,5-bisphosphate 3-kinase catalytic subunit delta isoform (PI3Kdelta)
Type:
Enzyme Subunit
Mol. Mass.:
119489.41
Organism:
Homo sapiens (Human)
Description:
O00329
Residue:
1044
  
Inhibitor
Name:
BDBM281503
Synonyms:
N-(5-(2-(1H- Benzo[d]imidazol- 2- yl)benzo[d]oxazol- 6-yl)-2- chloropyridin-3- yl)-4- fluorobenzene- sulfonamide US10596184, Example 29 | US9586949, Example 29
Type:
Small organic molecule
Emp. Form.:
C25H15ClFN5O3S
Mol. Mass.:
519.935
SMILES:
Fc1ccc(cc1)S(=O)(=O)Nc1cc(cnc1Cl)-c1ccc2nc(oc2c1)-c1nc2ccccc2[nH]1
: