Target
Phosphatidylinositol 4,5-bisphosphate 3-kinase catalytic subunit gamma isoform
Ligand
BDBM281554
Substrate
Meas. Tech.
Scintillation Proximity Assay
IC50
<250±n/a nM
Citation
 Zou, GCombs, AP Aza-heteroaryl compounds as PI3K-gamma inhibitors US Patent  US10596184 Publication Date 3/24/2020 
Target
Name:
Phosphatidylinositol 4,5-bisphosphate 3-kinase catalytic subunit gamma isoform
Synonyms:
PI3-kinase p110 subunit gamma PI3Kgamma PK3CG_HUMAN Phosphatidylinositol 4,5-bisphosphate 3-kinase (PI3K) Phosphatidylinositol 4,5-bisphosphate 3-kinase catalytic subunit gamma (PI3Kgamma) Phosphatidylinositol 4,5-bisphosphate 3-kinase catalytic subunit gamma isoform (PI3K) Phosphatidylinositol-4,5-bisphosphate 3-kinase catalytic subunit gamma isoform Phosphoinositide 3-kinases gamma (PI3K gamma) p120-PI3K
Type:
Enzyme Subunit
Mol. Mass.:
126470.30
Organism:
Homo sapiens (Human)
Description:
P48736
Residue:
1102
  
Inhibitor
Name:
BDBM281554
Synonyms:
US10022387, Example 80 US9586949, Example 80
Type:
Small organic molecule
Emp. Form.:
C23H19FN4O4S
Mol. Mass.:
466.485
SMILES:
CCS(=O)(=O)Nc1cc(cc(F)c1OC)-c1ccc2nc(oc2c1)-c1nc2ccccc2[nH]1
: