Target
Endothelial PAS domain-containing protein 1
Ligand
BDBM372987
Substrate
Meas. Tech.
Scintillation Proximity Assay (SPA)
IC50
<5.00±n/a nM
Citation
 Dixon, DDGrina, JJosey, JARizzi, JPSchlachter, STWallace, EMWang, BWehn, PXu, RYang, H Aryl ethers and uses thereof US Patent  US10597366 Publication Date 3/24/2020 
Target
Name:
Endothelial PAS domain-containing protein 1
Synonyms:
BHLHE73 EPAS1_HUMAN MOP2 endothelial PAS domain-containing protein 1
Type:
PROTEIN
Mol. Mass.:
96453.58
Organism:
Homo sapiens (Human)
Description:
ChEMBL_1506501
Residue:
870
  
Inhibitor
Name:
BDBM372987
Synonyms:
US10597366, Compound 34 | US9896418, Compound 34
Type:
Small organic molecule
Emp. Form.:
C15H9F4NO3S
Mol. Mass.:
359.295
SMILES:
Cc1c(C#N)c(Oc2cc(F)cc(F)c2)ccc1S(=O)(=O)C(F)F
: