Target
Endothelial PAS domain-containing protein 1
Ligand
BDBM373004
Substrate
Meas. Tech.
Scintillation Proximity Assay (SPA)
IC50
<5.00±n/a nM
Citation
 Dixon, DDGrina, JJosey, JARizzi, JPSchlachter, STWallace, EMWang, BWehn, PXu, RYang, H Aryl ethers and uses thereof US Patent  US10597366 Publication Date 3/24/2020 
Target
Name:
Endothelial PAS domain-containing protein 1
Synonyms:
BHLHE73 EPAS1_HUMAN MOP2 endothelial PAS domain-containing protein 1
Type:
PROTEIN
Mol. Mass.:
96453.58
Organism:
Homo sapiens (Human)
Description:
ChEMBL_1506501
Residue:
870
  
Inhibitor
Name:
BDBM373004
Synonyms:
US10597366, Compound 158 | US9896418, Compound 158
Type:
Small organic molecule
Emp. Form.:
C16H10ClF5O4S
Mol. Mass.:
428.758
SMILES:
O[C@H]1c2c(CC1(F)F)c(Oc1cc(F)cc(Cl)c1)ccc2S(=O)(=O)C(F)F
: