Target
Endothelial PAS domain-containing protein 1
Ligand
BDBM373008
Substrate
Meas. Tech.
Scintillation Proximity Assay (SPA)
IC50
8.50±n/a nM
Citation
 Dixon, DDGrina, JJosey, JARizzi, JPSchlachter, STWallace, EMWang, BWehn, PXu, RYang, H Aryl ethers and uses thereof US Patent  US10597366 Publication Date 3/24/2020 
Target
Name:
Endothelial PAS domain-containing protein 1
Synonyms:
BHLHE73 EPAS1_HUMAN MOP2 endothelial PAS domain-containing protein 1
Type:
PROTEIN
Mol. Mass.:
96453.58
Organism:
Homo sapiens (Human)
Description:
ChEMBL_1506501
Residue:
870
  
Inhibitor
Name:
BDBM373008
Synonyms:
US10597366, Compound 163 | US9896418, Compound 163
Type:
Small organic molecule
Emp. Form.:
C17H12F3NO4S
Mol. Mass.:
383.342
SMILES:
CS(=O)(=O)c1ccc(Oc2cc(F)cc(c2)C#N)c2CC(F)(F)[C@@H](O)c12
: