Target
Endothelial PAS domain-containing protein 1
Ligand
BDBM373016
Substrate
Meas. Tech.
Scintillation Proximity Assay (SPA)
IC50
<5.00±n/a nM
Citation
 Dixon, DDGrina, JJosey, JARizzi, JPSchlachter, STWallace, EMWang, BWehn, PXu, RYang, H Aryl ethers and uses thereof US Patent  US10597366 Publication Date 3/24/2020 
Target
Name:
Endothelial PAS domain-containing protein 1
Synonyms:
BHLHE73 EPAS1_HUMAN MOP2 endothelial PAS domain-containing protein 1
Type:
PROTEIN
Mol. Mass.:
96453.58
Organism:
Homo sapiens (Human)
Description:
ChEMBL_1506501
Residue:
870
  
Inhibitor
Name:
BDBM373016
Synonyms:
US10597366, Compound 186 | US9896418, Compound 186
Type:
Small organic molecule
Emp. Form.:
C15H9ClF5NO4S
Mol. Mass.:
429.746
SMILES:
O[C@H]1c2c(CC1(F)F)c(Oc1cncc(Cl)c1)ccc2S(=O)(=O)C(F)(F)F
: